{"text_format":"3","workbook":"xlsx","n_sheets":3,"sheets":["Sheet1","Sheet2","Sheet3"],"not_rendered":{"external_links":2,"defined_names":1},"read":"whole","date_system":"1900"}

{"sheet":"Sheet1","index":0,"n_rows":489,"n_cols":20,"rows_kept":489,"merged":[[0,0,0,18],[1,0,1,18],[2,0,2,18],[3,0,4,0],[3,1,4,1],[3,2,4,2],[3,3,4,3],[3,4,4,4],[3,5,4,5],[3,6,4,6],[3,7,4,7],[3,8,4,8],[3,9,3,10],[3,11,3,12],[3,13,3,14],[3,15,4,15],[3,16,4,16],[3,17,4,17],[3,18,4,18],[489,0,489,18]]}
["柳州职业技术大学2025届全日制专科毕业生毕业资格审核表"]
["填表说明：\n1.第6、7、8行是填写模板。                                                                                                                                                 \n2.学号、姓名的信息从《学信网2025届全日制专科学生信息基础数据》表中按照班级筛选并粘贴。                                                               \n3.必修课不及格门数填写学生到统计数据为止成绩未达到60分的课程总门数，如李四只有《大学生安全教育》课程不及格，其他课程成绩合格，那么李四必修课不及格门数填写“1”；选修课已修学分填写学生到统计数据为止总共修得的学分，如李四共修公共选修课两门（一门课程学分为2分，另一门课程学分3分）并且成绩合格，那么李四选课程已修学分为“5”。                                                                                                                   \n4.第二课堂学分和诚信分填写具体获得的分数，若第二课堂学分>=120，填写“是”，若＜填“否”；诚信分>=1800，填写“是”，若＜填“否”。 德育审查如有仍未解除的，填写“否”，如没有违纪记录的，在“违纪处分是否解除”栏划斜线“/”。德育审查结果不能留空。                                                                                           \n5.假若学生“必修课程不及格门数”为“0”、“选修课已修学分”总分15分、“第二课堂学分>=120”、“诚信分>=1800”都填写“是”，则学生达到毕业要求，在“是否达到毕业资格”填写“是”，若以上条件有一列未达到要求，请填写“否”；                                                                                   \n6.请如实填写“欠费金额”。\n7.上交纸质材料的时候二级学院要盖公章，电子档不需要盖电子章，但是要如实填写上报日期、专业要与《学信网2025届全日制专科学生信息基础数据》专业名称一致。\n8.结业原因填写序号：①必修课未通过②选修课未达标③综合素质考评不达标（综合素质包括第二课堂活动分、诚信分及德育审查项目）"]
["二级学院（盖章）：贸易与旅游管理学院          应毕业人数： 484     毕业人数：       结业人数：                            填表日期："]
["序号","专业名称","班别","学号","学生姓名","必修课不及格门数","必修课不及格具体课程名称","是否已修四史课","选修课\n总学分","第二课堂活动分",null,"诚信分",null,"德育审查",null,"是否达到毕业要求","毕结业\n结论","欠费金额","结业\n原因"]
[{"$nulls":9},"分数","是否≥120","分数","是否≥1800","是否有违纪处分","违纪处分是否解除"]
[1,"电子商务",1,"20190310045","罗永秀",3,"营销基础、习近平新时代中国特色社会主义思想概论、网页开发与设计","是",42,{"$f":"VLOOKUP(D6,[1]sheet1!$A:$C,3,0)","v":336},"是",{"$f":"VLOOKUP(D6,[1]sheet1!$A$1:$C$293,2,0)","v":3120},"是","否","/","否","结业",{"v":0,"d":"¥0.00"},1]
[2,"电子商务",1,"20210606085","陈广",3,"习近平新时代中国特色社会主义思想概论","是",41,{"$f":"VLOOKUP(D7,[1]sheet1!$A:$C,3,0)","v":301},"是",{"$f":"VLOOKUP(D7,[1]sheet1!$A$1:$C$293,2,0)","v":1850},"是","是","是","否","结业",{"v":0,"d":"¥0.00"},1]
[3,"电子商务",1,"20210606180","徐宗才",1,"习近平新时代中国特色社会主义思想概论","是",35,{"$f":"VLOOKUP(D8,[1]sheet1!$A:$C,3,0)","v":312},"是",{"$f":"VLOOKUP(D8,[1]sheet1!$A$1:$C$293,2,0)","v":1970},"是","否","/","否","结业",{"v":0,"d":"¥0.00"},1]
[4,"电子商务",1,"20220606138","官蝶兰",0,"无","是",42.5,{"$f":"VLOOKUP(D9,[1]sheet1!$A:$C,3,0)","v":365},"是",{"$f":"VLOOKUP(D9,[1]sheet1!$A$1:$C$293,2,0)","v":2680},"是","否","/","是","毕业",{"v":0,"d":"¥0.00"}]
[5,"电子商务",1,"20220606149","杨皓然",0,"无","是",43.5,{"$f":"VLOOKUP(D10,[1]sheet1!$A:$C,3,0)","v":243},"是",{"$f":"VLOOKUP(D10,[1]sheet1!$A$1:$C$293,2,0)","v":2390},"是","否","/","是","毕业",{"v":0,"d":"¥0.00"}]
[6,"电子商务",1,"20220606148","王敬轩",0,"无","是",40.5,{"$f":"VLOOKUP(D11,[1]sheet1!$A:$C,3,0)","v":277},"是",{"$f":"VLOOKUP(D11,[1]sheet1!$A$1:$C$293,2,0)","v":2620},"是","否","/","是","毕业",{"v":0,"d":"¥0.00"}]
[7,"电子商务",1,"20220606152","许兆蒴",0,"无","是",45.5,{"$f":"VLOOKUP(D12,[1]sheet1!$A:$C,3,0)","v":436},"是",{"$f":"VLOOKUP(D12,[1]sheet1!$A$1:$C$293,2,0)","v":2580},"是","否","/","是","毕业",{"v":0,"d":"¥0.00"}]
[8,"电子商务",1,"20220606022","黄千芸",0,"无","是",44.5,{"$f":"VLOOKUP(D13,[1]sheet1!$A:$C,3,0)","v":294},"是",{"$f":"VLOOKUP(D13,[1]sheet1!$A$1:$C$293,2,0)","v":2570},"是","否","/","是","毕业",{"v":0,"d":"¥0.00"}]
[9,"电子商务",1,"20220606004","刘昕元",1,"职场英语","是",39.5,{"$f":"VLOOKUP(D14,[1]sheet1!$A:$C,3,0)","v":229},"是",{"$f":"VLOOKUP(D14,[1]sheet1!$A$1:$C$293,2,0)","v":1940},"是","否","/","否","结业",{"v":0,"d":"¥0.00"},1]
[10,"电子商务",1,"20220606061","王月妮",0,"无","是",41.5,{"$f":"VLOOKUP(D15,[1]sheet1!$A:$C,3,0)","v":352},"是",{"$f":"VLOOKUP(D15,[1]sheet1!$A$1:$C$293,2,0)","v":3050},"是","否","/","是","毕业",{"v":0,"d":"¥0.00"}]
[11,"电子商务",1,"20220606109","简俊铃",0,"无","是",44.5,{"$f":"VLOOKUP(D16,[1]sheet1!$A:$C,3,0)","v":345},"是",{"$f":"VLOOKUP(D16,[1]sheet1!$A$1:$C$293,2,0)","v":2010},"是","否","/","是","毕业",{"v":0,"d":"¥0.00"}]
[12,"电子商务",1,"20220606134","张思琪",0,"无","是",43.5,{"$f":"VLOOKUP(D17,[1]sheet1!$A:$C,3,0)","v":309},"是",{"$f":"VLOOKUP(D17,[1]sheet1!$A$1:$C$293,2,0)","v":3300},"是","否","/","是","毕业",{"v":0,"d":"¥0.00"}]
[13,"电子商务",1,"20220606141","韦平军",0,"无","是",45.5,{"$f":"VLOOKUP(D18,[1]sheet1!$A:$C,3,0)","v":277},"是",{"$f":"VLOOKUP(D18,[1]sheet1!$A$1:$C$293,2,0)","v":2290},"是","否","/","是","毕业",{"v":0,"d":"¥0.00"}]
[14,"电子商务",1,"20220606133","李欣",0,"无","是",41.5,{"$f":"VLOOKUP(D19,[1]sheet1!$A:$C,3,0)","v":469},"是",{"$f":"VLOOKUP(D19,[1]sheet1!$A$1:$C$293,2,0)","v":3530},"是","否","/","是","毕业",{"v":0,"d":"¥0.00"}]
[15,"电子商务",1,"20220606002","黄伟恒",0,"无","是",43.5,{"$f":"VLOOKUP(D20,[1]sheet1!$A:$C,3,0)","v":308},"是",{"$f":"VLOOKUP(D20,[1]sheet1!$A$1:$C$293,2,0)","v":2420},"是","否","/","是","毕业",{"v":0,"d":"¥0.00"}]
[16,"电子商务",1,"20220606020","莫月珍",0,"无","是",39.5,{"$f":"VLOOKUP(D21,[1]sheet1!$A:$C,3,0)","v":396},"是",{"$f":"VLOOKUP(D21,[1]sheet1!$A$1:$C$293,2,0)","v":2180},"是","否","/","是","毕业",{"v":0,"d":"¥0.00"}]
[17,"电子商务",1,"20220606012","覃佩娱",0,"无","是",46.5,{"$f":"VLOOKUP(D22,[1]sheet1!$A:$C,3,0)","v":264},"是",{"$f":"VLOOKUP(D22,[1]sheet1!$A$1:$C$293,2,0)","v":2220},"是","否","/","是","毕业",{"v":0,"d":"¥0.00"}]
[18,"电子商务",1,"20220606063","覃茜维",0,"无","是",43.5,{"$f":"VLOOKUP(D23,[1]sheet1!$A:$C,3,0)","v":436},"是",{"$f":"VLOOKUP(D23,[1]sheet1!$A$1:$C$293,2,0)","v":3340},"是","否","/","是","毕业",{"v":0,"d":"¥0.00"}]
[19,"电子商务",1,"20220606101","王佳琪",0,"无","是",41.5,{"$f":"VLOOKUP(D24,[1]sheet1!$A:$C,3,0)","v":455},"是",{"$f":"VLOOKUP(D24,[1]sheet1!$A$1:$C$293,2,0)","v":3280},"是","否","/","是","毕业",{"v":0,"d":"¥0.00"}]
[20,"电子商务",1,"20220111029","张译骞",0,"无","是",43.5,{"$f":"VLOOKUP(D25,[1]sheet1!$A:$C,3,0)","v":229},"是",{"$f":"VLOOKUP(D25,[1]sheet1!$A$1:$C$293,2,0)","v":1920},"是","否","/","是","毕业",{"v":0,"d":"¥0.00"}]
[21,"电子商务",1,"20220606007","刘海琪",0,"无","是",48.5,{"$f":"VLOOKUP(D26,[1]sheet1!$A:$C,3,0)","v":304},"是",{"$f":"VLOOKUP(D26,[1]sheet1!$A$1:$C$293,2,0)","v":3110},"是","否","/","是","毕业",{"v":0,"d":"¥0.00"}]
[22,"电子商务",1,"20220606046","廖俊洋",0,"无","是",38.5,{"$f":"VLOOKUP(D27,[1]sheet1!$A:$C,3,0)","v":282},"是",{"$f":"VLOOKUP(D27,[1]sheet1!$A$1:$C$293,2,0)","v":2070},"是","否","/","是","毕业",{"v":0,"d":"¥0.00"}]
[23,"电子商务",1,"20220606045","蔡良甜",0,"无","是",43.5,{"$f":"VLOOKUP(D28,[1]sheet1!$A:$C,3,0)","v":273},"是",{"$f":"VLOOKUP(D28,[1]sheet1!$A$1:$C$293,2,0)","v":2090},"是","否","/","是","毕业",{"v":0,"d":"¥0.00"}]
[24,"电子商务",1,"20220210041","李雪龙",1,"职场英语","是",41.5,{"$f":"VLOOKUP(D29,[1]sheet1!$A:$C,3,0)","v":257},"是",{"$f":"VLOOKUP(D29,[1]sheet1!$A$1:$C$293,2,0)","v":1800},"是","是","是","否","结业",{"v":0,"d":"¥0.00"},1]
[25,"电子商务",1,"20220606112","李嘉彬",0,"无","是",37.5,{"$f":"VLOOKUP(D30,[1]sheet1!$A:$C,3,0)","v":386},"是",{"$f":"VLOOKUP(D30,[1]sheet1!$A$1:$C$293,2,0)","v":2320},"是","否","/","是","毕业",{"v":0,"d":"¥0.00"}]
[26,"电子商务",1,"20220606037","李醒龙",0,"无","是",43.5,{"$f":"VLOOKUP(D31,[1]sheet1!$A:$C,3,0)","v":333},"是",{"$f":"VLOOKUP(D31,[1]sheet1!$A$1:$C$293,2,0)","v":2270},"是","否","/","是","毕业",{"v":0,"d":"¥0.00"}]
[27,"电子商务",1,"20220606116","陈思娜",0,"无","是",43.5,{"$f":"VLOOKUP(D32,[1]sheet1!$A:$C,3,0)","v":233},"是",{"$f":"VLOOKUP(D32,[1]sheet1!$A$1:$C$293,2,0)","v":2670},"是","否","/","是","毕业",{"v":0,"d":"¥0.00"}]
[28,"电子商务",1,"20220606126","胡燕凤",0,"无","是",46.5,{"$f":"VLOOKUP(D33,[1]sheet1!$A:$C,3,0)","v":280},"是",{"$f":"VLOOKUP(D33,[1]sheet1!$A$1:$C$293,2,0)","v":2300},"是","否","/","是","毕业",{"v":0,"d":"¥0.00"}]
[29,"电子商务",1,"20220606122","麦春蓉",0,"无","是",42.5,{"$f":"VLOOKUP(D34,[1]sheet1!$A:$C,3,0)","v":273},"是",{"$f":"VLOOKUP(D34,[1]sheet1!$A$1:$C$293,2,0)","v":2600},"是","否","/","是","毕业",{"v":0,"d":"¥0.00"}]
[30,"电子商务",1,"20220606025","韦艳麟",0,"无","是",28.5,{"$f":"VLOOKUP(D35,[1]sheet1!$A:$C,3,0)","v":235},"是",{"$f":"VLOOKUP(D35,[1]sheet1!$A$1:$C$293,2,0)","v":2270},"是","是","是","是","毕业",{"v":0,"d":"¥0.00"}]
[31,"电子商务",1,"20220606014","刘元俊",0,"无","是",41.5,{"$f":"VLOOKUP(D36,[1]sheet1!$A:$C,3,0)","v":248},"是",{"$f":"VLOOKUP(D36,[1]sheet1!$A$1:$C$293,2,0)","v":1830},"是","否","/","是","毕业",{"v":0,"d":"¥0.00"}]
[32,"电子商务",1,"20220606078","贲和靖",0,"无","是",38.5,{"$f":"VLOOKUP(D37,[1]sheet1!$A:$C,3,0)","v":259},"是",{"$f":"VLOOKUP(D37,[1]sheet1!$A$1:$C$293,2,0)","v":2140},"是","否","/","是","毕业",{"v":0,"d":"¥0.00"}]
[33,"电子商务",1,"20220606151","徐己振",0,"无","是",46.5,{"$f":"VLOOKUP(D38,[1]sheet1!$A:$C,3,0)","v":443},"是",{"$f":"VLOOKUP(D38,[1]sheet1!$A$1:$C$293,2,0)","v":2190},"是","否","/","是","毕业",{"v":0,"d":"¥0.00"}]
[34,"电子商务",1,"20220606147","吴施敏",0,"无","是",42.5,{"$f":"VLOOKUP(D39,[1]sheet1!$A:$C,3,0)","v":409},"是",{"$f":"VLOOKUP(D39,[1]sheet1!$A$1:$C$293,2,0)","v":2640},"是","否","/","是","毕业",{"v":0,"d":"¥0.00"}]
[35,"电子商务",1,"20220606105","吴秋楠",0,"无","是",44.5,{"$f":"VLOOKUP(D40,[1]sheet1!$A:$C,3,0)","v":249},"是",{"$f":"VLOOKUP(D40,[1]sheet1!$A$1:$C$293,2,0)","v":1940},"是","否","/","是","毕业",{"v":0,"d":"¥0.00"}]
[36,"电子商务",1,"20220606132","莫月华",0,"无","是",41.5,{"$f":"VLOOKUP(D41,[1]sheet1!$A:$C,3,0)","v":461},"是",{"$f":"VLOOKUP(D41,[1]sheet1!$A$1:$C$293,2,0)","v":4360},"是","否","/","是","毕业",{"v":0,"d":"¥0.00"}]
[37,"电子商务",1,"20220606139","肖海霞",0,"无","是",43.5,{"$f":"VLOOKUP(D42,[1]sheet1!$A:$C,3,0)","v":427},"是",{"$f":"VLOOKUP(D42,[1]sheet1!$A$1:$C$293,2,0)","v":2440},"是","否","/","是","毕业",{"v":0,"d":"¥0.00"}]
[38,"电子商务",1,"20220606013","潘茜宁",0,"无","是",44.5,{"$f":"VLOOKUP(D43,[1]sheet1!$A:$C,3,0)","v":350},"是",{"$f":"VLOOKUP(D43,[1]sheet1!$A$1:$C$293,2,0)","v":3160},"是","否","/","是","毕业",{"v":0,"d":"¥0.00"}]
[39,"电子商务",1,"20220508051","黄瀚洲",0,"无","是",40.5,{"$f":"VLOOKUP(D44,[1]sheet1!$A:$C,3,0)","v":274},"是",{"$f":"VLOOKUP(D44,[1]sheet1!$A$1:$C$293,2,0)","v":2080},"是","是","是","是","毕业",{"v":0,"d":"¥0.00"}]
[40,"电子商务",1,"20220606035","郑雅惠",0,"无","是",44.5,{"$f":"VLOOKUP(D45,[1]sheet1!$A:$C,3,0)","v":288},"是",{"$f":"VLOOKUP(D45,[1]sheet1!$A$1:$C$293,2,0)","v":2140},"是","否","/","是","毕业",{"v":0,"d":"¥0.00"}]
[41,"电子商务",1,"20220606017","许怡凤",0,"无","是",42.5,{"$f":"VLOOKUP(D46,[1]sheet1!$A:$C,3,0)","v":412},"是",{"$f":"VLOOKUP(D46,[1]sheet1!$A$1:$C$293,2,0)","v":2470},"是","否","/","是","毕业",{"v":0,"d":"¥0.00"}]
[42,"电子商务",1,"20220606130","陈钰铧",0,"无","是",47.5,{"$f":"VLOOKUP(D47,[1]sheet1!$A:$C,3,0)","v":246},"是",{"$f":"VLOOKUP(D47,[1]sheet1!$A$1:$C$293,2,0)","v":2680},"是","否","/","是","毕业",{"v":0,"d":"¥0.00"}]
[43,"电子商务",1,"20220606137","李盈燕",0,"无","是",44.5,{"$f":"VLOOKUP(D48,[1]sheet1!$A:$C,3,0)","v":266},"是",{"$f":"VLOOKUP(D48,[1]sheet1!$A$1:$C$293,2,0)","v":2300},"是","否","/","是","毕业",{"v":0,"d":"¥0.00"}]
[44,"电子商务",1,"20220606031","罗耀祖",0,"无","是",45.5,{"$f":"VLOOKUP(D49,[1]sheet1!$A:$C,3,0)","v":244},"是",{"$f":"VLOOKUP(D49,[1]sheet1!$A$1:$C$293,2,0)","v":2090},"是","否","/","是","毕业",{"v":0,"d":"¥0.00"}]
[45,"电子商务",1,"20220606072","韦海文",0,"无","是",42.5,{"$f":"VLOOKUP(D50,[1]sheet1!$A:$C,3,0)","v":367},"是",{"$f":"VLOOKUP(D50,[1]sheet1!$A$1:$C$293,2,0)","v":3200},"是","否","/","是","毕业",{"v":0,"d":"¥0.00"}]
[46,"电子商务",1,"20220606118","蔡小红",0,"无","是",43.5,{"$f":"VLOOKUP(D51,[1]sheet1!$A:$C,3,0)","v":316},"是",{"$f":"VLOOKUP(D51,[1]sheet1!$A$1:$C$293,2,0)","v":2460},"是","否","/","是","毕业",{"v":0,"d":"¥0.00"}]
[47,"电子商务",1,"20220606052","贾琦",0,"无","是",48.5,{"$f":"VLOOKUP(D52,[1]sheet1!$A:$C,3,0)","v":462},"是",{"$f":"VLOOKUP(D52,[1]sheet1!$A$1:$C$293,2,0)","v":3160},"是","否","/","是","毕业",{"v":0,"d":"¥0.00"}]
[48,"电子商务",1,"20220606039","王玉红",0,"无","是",43.5,{"$f":"VLOOKUP(D53,[1]sheet1!$A:$C,3,0)","v":307},"是",{"$f":"VLOOKUP(D53,[1]sheet1!$A$1:$C$293,2,0)","v":2560},"是","否","/","是","毕业",{"v":0,"d":"¥0.00"}]
[49,"电子商务",1,"20220606117","吴湘怡",0,"无","是",41.5,{"$f":"VLOOKUP(D54,[1]sheet1!$A:$C,3,0)","v":374},"是",{"$f":"VLOOKUP(D54,[1]sheet1!$A$1:$C$293,2,0)","v":2540},"是","否","/","是","毕业",{"v":0,"d":"¥0.00"}]
[50,"电子商务",1,"20220606114","潘柳柳",0,"无","是",48.5,{"$f":"VLOOKUP(D55,[1]sheet1!$A:$C,3,0)","v":342},"是",{"$f":"VLOOKUP(D55,[1]sheet1!$A$1:$C$293,2,0)","v":2540},"是","否","/","是","毕业",{"v":0,"d":"¥0.00"}]
[51,"电子商务",1,"20220606115","曾瑞璋",0,"无","是",43.5,{"$f":"VLOOKUP(D56,[1]sheet1!$A:$C,3,0)","v":257},"是",{"$f":"VLOOKUP(D56,[1]sheet1!$A$1:$C$293,2,0)","v":1890},"是","否","/","是","毕业",{"v":0,"d":"¥0.00"}]
[52,"电子商务",1,"20220606113","秦素珍",0,"无","是",44.5,{"$f":"VLOOKUP(D57,[1]sheet1!$A:$C,3,0)","v":316},"是",{"$f":"VLOOKUP(D57,[1]sheet1!$A$1:$C$293,2,0)","v":3060},"是","否","/","是","毕业",{"v":0,"d":"¥0.00"}]
[53,"电子商务",1,"20220606016","吴晓磊",0,"无","是",44.5,{"$f":"VLOOKUP(D58,[1]sheet1!$A:$C,3,0)","v":253},"是",{"$f":"VLOOKUP(D58,[1]sheet1!$A$1:$C$293,2,0)","v":2190},"是","否","/","是","毕业",{"v":0,"d":"¥0.00"}]
[54,"电子商务",1,"20220606145","叶姿麟",0,"无","是",43.5,{"$f":"VLOOKUP(D59,[1]sheet1!$A:$C,3,0)","v":332},"是",{"$f":"VLOOKUP(D59,[1]sheet1!$A$1:$C$293,2,0)","v":2940},"是","否","/","是","毕业",{"v":0,"d":"¥0.00"}]
[55,"电子商务",2,"20210606035","梁欣悦",0,"无","是",41.5,{"$f":"VLOOKUP(D60,[1]sheet1!$A:$C,3,0)","v":240},"是",{"$f":"VLOOKUP(D60,[1]sheet1!$A$1:$C$293,2,0)","v":1920},"是","否","/","是","毕业",{"v":0,"d":"¥0.00"}]
[56,"电子商务",2,"20220606153","章涛",1,"营销基础","是",44.5,{"$f":"VLOOKUP(D61,[1]sheet1!$A:$C,3,0)","v":253},"是",{"$f":"VLOOKUP(D61,[1]sheet1!$A$1:$C$293,2,0)","v":2010},"是","否","/","否","结业",{"v":0,"d":"¥0.00"},1]
[57,"电子商务",2,"20220606157","辜胜航",3,"网店客户关系管理、思想道德与法治、职业发展与就业指导（一）","是",40,{"$f":"VLOOKUP(D62,[1]sheet1!$A:$C,3,0)","v":297},"是",{"$f":"VLOOKUP(D62,[1]sheet1!$A$1:$C$293,2,0)","v":1950},"是","否","/","否","结业",{"v":0,"d":"¥0.00"},1]
[58,"电子商务",2,"20220606142","罗亚花",0,"无","是",43.5,{"$f":"VLOOKUP(D63,[1]sheet1!$A:$C,3,0)","v":253},"是",{"$f":"VLOOKUP(D63,[1]sheet1!$A$1:$C$293,2,0)","v":2360},"是","否","/","是","毕业",{"v":0,"d":"¥0.00"}]
[59,"电子商务",2,"20220606106","史倩倩",0,"无","是",37.5,{"$f":"VLOOKUP(D64,[1]sheet1!$A:$C,3,0)","v":248},"是",{"$f":"VLOOKUP(D64,[1]sheet1!$A$1:$C$293,2,0)","v":2160},"是","否","/","是","毕业",{"v":0,"d":"¥0.00"}]
[60,"电子商务",2,"20220606160","努尔伊萨拉姆·努尔艾合麦提",0,"无","是",43.5,{"$f":"VLOOKUP(D65,[1]sheet1!$A:$C,3,0)","v":304},"是",{"$f":"VLOOKUP(D65,[1]sheet1!$A$1:$C$293,2,0)","v":2890},"是","否","/","是","毕业",{"v":0,"d":"¥0.00"}]
[61,"电子商务",2,"20220606158","木尼然·玉买尔",0,"无","是",43.5,{"$f":"VLOOKUP(D66,[1]sheet1!$A:$C,3,0)","v":305},"是",{"$f":"VLOOKUP(D66,[1]sheet1!$A$1:$C$293,2,0)","v":2750},"是","否","/","是","毕业",{"v":0,"d":"¥0.00"}]
[62,"电子商务",2,"20220606155","孟原颉",0,"无","是",37.5,{"$f":"VLOOKUP(D67,[1]sheet1!$A:$C,3,0)","v":284},"是",{"$f":"VLOOKUP(D67,[1]sheet1!$A$1:$C$293,2,0)","v":2790},"是","否","/","是","毕业",{"v":0,"d":"¥0.00"}]
[63,"电子商务",2,"20220606143","李思娣",0,"无","是",40.5,{"$f":"VLOOKUP(D68,[1]sheet1!$A:$C,3,0)","v":271},"是",{"$f":"VLOOKUP(D68,[1]sheet1!$A$1:$C$293,2,0)","v":2320},"是","否","/","是","毕业",{"v":0,"d":"¥0.00"}]
[64,"电子商务",2,"20220606108","王小妹",0,"无","是",41.5,{"$f":"VLOOKUP(D69,[1]sheet1!$A:$C,3,0)","v":268},"是",{"$f":"VLOOKUP(D69,[1]sheet1!$A$1:$C$293,2,0)","v":2250},"是","否","/","是","毕业",{"v":0,"d":"¥0.00"}]
[65,"电子商务",2,"20220606107","雷旺",0,"无","是",39.5,{"$f":"VLOOKUP(D70,[1]sheet1!$A:$C,3,0)","v":250},"是",{"$f":"VLOOKUP(D70,[1]sheet1!$A$1:$C$293,2,0)","v":2290},"是","否","/","是","毕业",{"v":0,"d":"¥0.00"}]
[66,"电子商务",2,"20220606034","余宏丹",0,"无","是",45.5,{"$f":"VLOOKUP(D71,[1]sheet1!$A:$C,3,0)","v":308},"是",{"$f":"VLOOKUP(D71,[1]sheet1!$A$1:$C$293,2,0)","v":2160},"是","否","/","是","毕业",{"v":0,"d":"¥0.00"}]
[67,"电子商务",2,"20220610095","易海青",0,"无","是",43.5,{"$f":"VLOOKUP(D72,[1]sheet1!$A:$C,3,0)","v":400},"是",{"$f":"VLOOKUP(D72,[1]sheet1!$A$1:$C$293,2,0)","v":2140},"是","否","/","是","毕业",{"v":0,"d":"¥0.00"}]
[68,"电子商务",2,"20210606209","梁桂玲",0,"无","是",42.5,{"$f":"VLOOKUP(D73,[1]sheet1!$A:$C,3,0)","v":318},"是",{"$f":"VLOOKUP(D73,[1]sheet1!$A$1:$C$293,2,0)","v":2960},"是","否","/","是","毕业",{"v":0,"d":"¥0.00"}]
[69,"电子商务",2,"20220606019","李林",0,"无","是",43.5,{"$f":"VLOOKUP(D74,[1]sheet1!$A:$C,3,0)","v":284},"是",{"$f":"VLOOKUP(D74,[1]sheet1!$A$1:$C$293,2,0)","v":2210},"是","否","/","是","毕业",{"v":0,"d":"¥0.00"}]
[70,"电子商务",2,"20220606111","钟国安",0,"无","是",43.5,{"$f":"VLOOKUP(D75,[1]sheet1!$A:$C,3,0)","v":381},"是",{"$f":"VLOOKUP(D75,[1]sheet1!$A$1:$C$293,2,0)","v":2740},"是","否","/","是","毕业",{"v":0,"d":"¥0.00"}]
[71,"电子商务",2,"20220606051","冼丽君",0,"无","是",41.5,{"$f":"VLOOKUP(D76,[1]sheet1!$A:$C,3,0)","v":249},"是",{"$f":"VLOOKUP(D76,[1]sheet1!$A$1:$C$293,2,0)","v":2340},"是","否","/","是","毕业",{"v":0,"d":"¥0.00"}]
[72,"电子商务",2,"20220606023","曹程阳",0,"无","是",47.5,{"$f":"VLOOKUP(D77,[1]sheet1!$A:$C,3,0)","v":364},"是",{"$f":"VLOOKUP(D77,[1]sheet1!$A$1:$C$293,2,0)","v":2920},"是","否","/","是","毕业",{"v":0,"d":"¥0.00"}]
[73,"电子商务",2,"20220606043","李锦雄",0,"无","是",37.5,{"$f":"VLOOKUP(D78,[1]sheet1!$A:$C,3,0)","v":335},"是",{"$f":"VLOOKUP(D78,[1]sheet1!$A$1:$C$293,2,0)","v":3440},"是","否","/","是","毕业",{"v":0,"d":"¥0.00"}]
[74,"电子商务",2,"20220708028","杨敏",0,"无","是",40.5,{"$f":"VLOOKUP(D79,[1]sheet1!$A:$C,3,0)","v":267},"是",{"$f":"VLOOKUP(D79,[1]sheet1!$A$1:$C$293,2,0)","v":2330},"是","否","/","是","毕业",{"v":0,"d":"¥0.00"}]
[75,"电子商务",2,"20220606135","谢梅婷",0,"无","是",41.5,{"$f":"VLOOKUP(D80,[1]sheet1!$A:$C,3,0)","v":302},"是",{"$f":"VLOOKUP(D80,[1]sheet1!$A$1:$C$293,2,0)","v":2650},"是","否","/","是","毕业",{"v":0,"d":"¥0.00"}]
[76,"电子商务",2,"20220606040","凌玉芬",0,"无","是",41.5,{"$f":"VLOOKUP(D81,[1]sheet1!$A:$C,3,0)","v":266},"是",{"$f":"VLOOKUP(D81,[1]sheet1!$A$1:$C$293,2,0)","v":2440},"是","否","/","是","毕业",{"v":0,"d":"¥0.00"}]
[77,"电子商务",2,"20220606124","莫慧红",0,"无","是",48.5,{"$f":"VLOOKUP(D82,[1]sheet1!$A:$C,3,0)","v":327},"是",{"$f":"VLOOKUP(D82,[1]sheet1!$A$1:$C$293,2,0)","v":2240},"是","否","/","是","毕业",{"v":0,"d":"¥0.00"}]
[78,"电子商务",2,"20220606011","梁丽琳",0,"无","是",44.5,{"$f":"VLOOKUP(D83,[1]sheet1!$A:$C,3,0)","v":400},"是",{"$f":"VLOOKUP(D83,[1]sheet1!$A$1:$C$293,2,0)","v":3170},"是","否","/","是","毕业",{"v":0,"d":"¥0.00"}]
[79,"电子商务",2,"20220606024","赵善富",0,"无","是",37.5,{"$f":"VLOOKUP(D84,[1]sheet1!$A:$C,3,0)","v":364},"是",{"$f":"VLOOKUP(D84,[1]sheet1!$A$1:$C$293,2,0)","v":3160},"是","否","/","是","毕业",{"v":0,"d":"¥0.00"}]
[80,"电子商务",2,"20220606008","李连星",1,"预就业实习（整周实践）","是",39.5,{"$f":"VLOOKUP(D85,[1]sheet1!$A:$C,3,0)","v":347},"是",{"$f":"VLOOKUP(D85,[1]sheet1!$A$1:$C$293,2,0)","v":2910},"是","否","/","否","结业",{"v":0,"d":"¥0.00"},1]
[81,"电子商务",2,"20220606001","李艳云",0,"无","是",41.5,{"$f":"VLOOKUP(D86,[1]sheet1!$A:$C,3,0)","v":359},"是",{"$f":"VLOOKUP(D86,[1]sheet1!$A$1:$C$293,2,0)","v":3560},"是","否","/","是","毕业",{"v":0,"d":"¥0.00"}]
[82,"电子商务",2,"20220107087","张珍梅",0,"无","是",42.5,{"$f":"VLOOKUP(D87,[1]sheet1!$A:$C,3,0)","v":269},"是",{"$f":"VLOOKUP(D87,[1]sheet1!$A$1:$C$293,2,0)","v":2450},"是","否","/","是","毕业",{"v":0,"d":"¥0.00"}]
[83,"电子商务",2,"20220606150","白玉娜",0,"无","是",40.5,{"$f":"VLOOKUP(D88,[1]sheet1!$A:$C,3,0)","v":264},"是",{"$f":"VLOOKUP(D88,[1]sheet1!$A$1:$C$293,2,0)","v":2290},"是","否","/","是","毕业",{"v":0,"d":"¥0.00"}]
[84,"电子商务",2,"20220606119","陈泰峰",0,"无","是",37.5,{"$f":"VLOOKUP(D89,[1]sheet1!$A:$C,3,0)","v":273},"是",{"$f":"VLOOKUP(D89,[1]sheet1!$A$1:$C$293,2,0)","v":2660},"是","否","/","是","毕业",{"v":0,"d":"¥0.00"}]
[85,"电子商务",2,"20220606005","陆伟豪",1,"预就业实习（整周实践）","是",38,{"$f":"VLOOKUP(D90,[1]sheet1!$A:$C,3,0)","v":289},"是",{"$f":"VLOOKUP(D90,[1]sheet1!$A$1:$C$293,2,0)","v":1860},"是","否","/","否","结业",{"v":0,"d":"¥0.00"},1]
[86,"电子商务",2,"20220604036","宋思颖",0,"无","是",41.5,{"$f":"VLOOKUP(D91,[1]sheet1!$A:$C,3,0)","v":244},"是",{"$f":"VLOOKUP(D91,[1]sheet1!$A$1:$C$293,2,0)","v":1870},"是","否","/","是","毕业",{"v":0,"d":"¥0.00"}]
[87,"电子商务",2,"20220606036","蒙宏俊",0,"无","是",45.5,{"$f":"VLOOKUP(D92,[1]sheet1!$A:$C,3,0)","v":286},"是",{"$f":"VLOOKUP(D92,[1]sheet1!$A$1:$C$293,2,0)","v":2240},"是","否","/","是","毕业",{"v":0,"d":"¥0.00"}]
[88,"电子商务",2,"20220606032","施建锋",0,"无","是",37.5,{"$f":"VLOOKUP(D93,[1]sheet1!$A:$C,3,0)","v":381},"是",{"$f":"VLOOKUP(D93,[1]sheet1!$A$1:$C$293,2,0)","v":3170},"是","否","/","是","毕业",{"v":0,"d":"¥0.00"}]
[89,"电子商务",2,"20220606006","李凯莹",0,"无","是",42.5,{"$f":"VLOOKUP(D94,[1]sheet1!$A:$C,3,0)","v":364},"是",{"$f":"VLOOKUP(D94,[1]sheet1!$A$1:$C$293,2,0)","v":3080},"是","否","/","是","毕业",{"v":0,"d":"¥0.00"}]
[90,"电子商务",2,"20220606125","覃秀芳",0,"无","是",44.5,{"$f":"VLOOKUP(D95,[1]sheet1!$A:$C,3,0)","v":302},"是",{"$f":"VLOOKUP(D95,[1]sheet1!$A$1:$C$293,2,0)","v":2400},"是","否","/","是","毕业",{"v":0,"d":"¥0.00"}]
[91,"电子商务",2,"20220606041","田业康",0,"无","是",39,{"$f":"VLOOKUP(D96,[1]sheet1!$A:$C,3,0)","v":229},"是",{"$f":"VLOOKUP(D96,[1]sheet1!$A$1:$C$293,2,0)","v":1970},"是","否","/","是","毕业",{"v":0,"d":"¥0.00"}]
[92,"电子商务",2,"20220606030","车柳玲",0,"无","是",40.5,{"$f":"VLOOKUP(D97,[1]sheet1!$A:$C,3,0)","v":346},"是",{"$f":"VLOOKUP(D97,[1]sheet1!$A$1:$C$293,2,0)","v":3460},"是","否","/","是","毕业",{"v":0,"d":"¥0.00"}]
[93,"电子商务",2,"20220606120","张欣宇",0,"无","是",41.5,{"$f":"VLOOKUP(D98,[1]sheet1!$A:$C,3,0)","v":280},"是",{"$f":"VLOOKUP(D98,[1]sheet1!$A$1:$C$293,2,0)","v":2540},"是","否","/","是","毕业",{"v":0,"d":"¥0.00"}]
[94,"电子商务",2,"20220606010","陈镇球",1,"营销基础","是",45,{"$f":"VLOOKUP(D99,[1]sheet1!$A:$C,3,0)","v":247},"是",{"$f":"VLOOKUP(D99,[1]sheet1!$A$1:$C$293,2,0)","v":2070},"是","否","/","否","结业",{"v":0,"d":"¥0.00"},1]
[95,"电子商务",2,"20220606048","李美坚",0,"无","是",43.5,{"$f":"VLOOKUP(D100,[1]sheet1!$A:$C,3,0)","v":299},"是",{"$f":"VLOOKUP(D100,[1]sheet1!$A$1:$C$293,2,0)","v":2090},"是","否","/","是","毕业",{"v":0,"d":"¥0.00"}]
[96,"电子商务",2,"20220606123","杨舒媛",0,"无","是",47.5,{"$f":"VLOOKUP(D101,[1]sheet1!$A:$C,3,0)","v":321},"是",{"$f":"VLOOKUP(D101,[1]sheet1!$A$1:$C$293,2,0)","v":2750},"是","否","/","是","毕业",{"v":0,"d":"¥0.00"}]
[97,"电子商务",2,"20220606042","陈钊",0,"无","是",38.5,{"$f":"VLOOKUP(D102,[1]sheet1!$A:$C,3,0)","v":348},"是",{"$f":"VLOOKUP(D102,[1]sheet1!$A$1:$C$293,2,0)","v":3330},"是","否","/","是","毕业",{"v":0,"d":"¥0.00"}]
[98,"电子商务",2,"20220606128","黄晓梅",0,"无","是",45.5,{"$f":"VLOOKUP(D103,[1]sheet1!$A:$C,3,0)","v":374},"是",{"$f":"VLOOKUP(D103,[1]sheet1!$A$1:$C$293,2,0)","v":2520},"是","否","/","是","毕业",{"v":0,"d":"¥0.00"}]
[99,"电子商务",2,"20220606033","孔维锦",1,"营销基础","是",43.5,{"$f":"VLOOKUP(D104,[1]sheet1!$A:$C,3,0)","v":373},"是",{"$f":"VLOOKUP(D104,[1]sheet1!$A$1:$C$293,2,0)","v":1940},"是","否","/","否","结业",{"v":0,"d":"¥0.00"},1]
[100,"电子商务",2,"20220606055","邓燕媚",0,"无","是",41.5,{"$f":"VLOOKUP(D105,[1]sheet1!$A:$C,3,0)","v":266},"是",{"$f":"VLOOKUP(D105,[1]sheet1!$A$1:$C$293,2,0)","v":2460},"是","否","/","是","毕业",{"v":0,"d":"¥0.00"}]
[101,"电子商务",2,"20220410058","李冰冰",0,"无","是",41.5,{"$f":"VLOOKUP(D106,[1]sheet1!$A:$C,3,0)","v":255},"是",{"$f":"VLOOKUP(D106,[1]sheet1!$A$1:$C$293,2,0)","v":2280},"是","否","/","是","毕业",{"v":0,"d":"¥0.00"}]
[102,"电子商务",2,"20220606015","覃范焯",0,"无","是",38.5,{"$f":"VLOOKUP(D107,[1]sheet1!$A:$C,3,0)","v":307},"是",{"$f":"VLOOKUP(D107,[1]sheet1!$A$1:$C$293,2,0)","v":3100},"是","否","/","是","毕业",{"v":0,"d":"¥0.00"}]
[103,"电子商务",2,"20220606028","祝金连",0,"无","是",40.5,{"$f":"VLOOKUP(D108,[1]sheet1!$A:$C,3,0)","v":334},"是",{"$f":"VLOOKUP(D108,[1]sheet1!$A$1:$C$293,2,0)","v":3220},"是","否","/","是","毕业",{"v":0,"d":"¥0.00"}]
[104,"电子商务",2,"20220606009","宁春燕",0,"无","是",41.5,{"$f":"VLOOKUP(D109,[1]sheet1!$A:$C,3,0)","v":263},"是",{"$f":"VLOOKUP(D109,[1]sheet1!$A$1:$C$293,2,0)","v":2270},"是","否","/","是","毕业",{"v":0,"d":"¥0.00"}]
[105,"电子商务",2,"20220222049","杨树",0,"无","是",43.5,{"$f":"VLOOKUP(D110,[1]sheet1!$A:$C,3,0)","v":446},"是",{"$f":"VLOOKUP(D110,[1]sheet1!$A$1:$C$293,2,0)","v":2760},"是","否","/","是","毕业",{"v":0,"d":"¥0.00"}]
[106,"电子商务",2,"20220606144","黎钦丰",0,"无","是",37.5,{"$f":"VLOOKUP(D111,[1]sheet1!$A:$C,3,0)","v":392},"是",{"$f":"VLOOKUP(D111,[1]sheet1!$A$1:$C$293,2,0)","v":3900},"是","否","/","是","毕业",{"v":0,"d":"¥0.00"}]
[107,"电子商务",2,"20220606110","刘梅秋",0,"无","是",45.5,{"$f":"VLOOKUP(D112,[1]sheet1!$A:$C,3,0)","v":328},"是",{"$f":"VLOOKUP(D112,[1]sheet1!$A$1:$C$293,2,0)","v":3290},"是","否","/","是","毕业",{"v":0,"d":"¥0.00"}]
[108,"酒店管理与数字化运营",1,"20220610005","周梦婷",0,"无","是",26,{"$f":"VLOOKUP(D113,[1]sheet1!$A:$C,3,0)","v":261},"是",{"$f":"VLOOKUP(D113,[1]sheet1!$A$1:$C$293,2,0)","v":2300},"是","否","/","是","毕业",{"v":0,"d":"¥0.00"}]
[109,"酒店管理与数字化运营",1,"20220610077","张龄",0,"无","是",28,{"$f":"VLOOKUP(D114,[1]sheet1!$A:$C,3,0)","v":230},"是",{"$f":"VLOOKUP(D114,[1]sheet1!$A$1:$C$293,2,0)","v":2350},"是","否","/","是","毕业",{"v":0,"d":"¥0.00"}]
[110,"酒店管理与数字化运营",1,"20220610096","邱冬",0,"无","是",28,{"$f":"VLOOKUP(D115,[1]sheet1!$A:$C,3,0)","v":428},"是",{"$f":"VLOOKUP(D115,[1]sheet1!$A$1:$C$293,2,0)","v":3080},"是","否","/","是","毕业",{"v":0,"d":"¥0.00"}]
[111,"酒店管理与数字化运营",1,"20220610055","卢佳婷",0,"无","是",26,{"$f":"VLOOKUP(D116,[1]sheet1!$A:$C,3,0)","v":243},"是",{"$f":"VLOOKUP(D116,[1]sheet1!$A$1:$C$293,2,0)","v":2190},"是","否","/","是","毕业",{"v":0,"d":"¥0.00"}]
[112,"酒店管理与数字化运营",1,"20220610074","覃秋玉",0,"无","是",28,{"$f":"VLOOKUP(D117,[1]sheet1!$A:$C,3,0)","v":268},"是",{"$f":"VLOOKUP(D117,[1]sheet1!$A$1:$C$293,2,0)","v":2330},"是","否","/","是","毕业",{"v":0,"d":"¥0.00"}]
[113,"酒店管理与数字化运营",1,"20220610090","董晓雨",0,"无","是",27,{"$f":"VLOOKUP(D118,[1]sheet1!$A:$C,3,0)","v":447},"是",{"$f":"VLOOKUP(D118,[1]sheet1!$A$1:$C$293,2,0)","v":3180},"是","否","/","是","毕业",{"v":0,"d":"¥0.00"}]
[114,"酒店管理与数字化运营",1,"20220610075","熊巧艳",0,"无","是",26,{"$f":"VLOOKUP(D119,[1]sheet1!$A:$C,3,0)","v":268},"是",{"$f":"VLOOKUP(D119,[1]sheet1!$A$1:$C$293,2,0)","v":2450},"是","否","/","是","毕业",{"v":0,"d":"¥0.00"}]
[115,"酒店管理与数字化运营",1,"20220610041","卢玉清",0,"无","是",29,{"$f":"VLOOKUP(D120,[1]sheet1!$A:$C,3,0)","v":303},"是",{"$f":"VLOOKUP(D120,[1]sheet1!$A$1:$C$293,2,0)","v":2410},"是","否","/","是","毕业",{"v":0,"d":"¥0.00"}]
{"$rows_left_out":370}
{"sheet":"Sheet2","index":1,"n_rows":0,"n_cols":0,"rows_kept":0}

{"sheet":"Sheet3","index":2,"n_rows":0,"n_cols":0,"rows_kept":0}