{"text_format":"3","workbook":"xlsx","n_sheets":2,"sheets":["Excel_20181112165445","Sheet1"],"not_rendered":{"external_links":1,"defined_names":2},"read":"whole","date_system":"1900"}

{"sheet":"Excel_20181112165445","index":0,"n_rows":476,"n_cols":6,"rows_kept":476,"merged":[[1,0,2,0],[1,1,2,1],[3,0,7,0],[3,1,7,1],[8,0,11,0],[8,1,11,1],[12,0,16,0],[12,1,16,1],[17,0,19,0],[17,1,19,1],[20,0,21,0],[20,1,21,1],[22,0,24,0],[22,1,24,1],[25,0,26,0],[25,1,26,1],[28,0,36,0],[28,1,36,1],[37,0,40,0],[37,1,40,1],[41,0,47,0],[41,1,47,1],[48,0,56,0],[48,1,56,1],[57,0,59,0],[57,1,59,1],[60,0,63,0],[60,1,63,1],[64,0,71,0],[64,1,71,1],[72,0,73,0],[72,1,73,1],[74,0,77,0],[74,1,77,1],[78,0,81,0],[78,1,81,1],[82,0,85,0],[82,1,85,1],[86,0,91,0],[86,1,91,1],[92,0,99,0],[92,1,99,1],[100,0,120,0],[100,1,120,1],[121,0,127,0],[121,1,127,1],[128,0,138,0],[128,1,138,1],[139,0,146,0],[139,1,146,1],[148,0,151,0],[148,1,151,1],[152,0,154,0],[152,1,154,1],[155,0,166,0],[155,1,166,1],[167,0,172,0],[167,1,172,1],[175,0,178,0],[175,1,178,1],[179,0,188,0],[179,1,188,1],[189,0,191,0],[189,1,191,1],[192,0,193,0],[192,1,193,1],[194,0,202,0],[194,1,202,1],[203,0,207,0],[203,1,207,1],[208,0,211,0],[208,1,211,1],[212,0,216,0],[212,1,216,1],[217,0,226,0],[217,1,226,1],[227,0,228,0],[227,1,228,1],[229,0,231,0],[229,1,231,1],[232,0,236,0],[232,1,236,1],[238,0,240,0],[238,1,240,1],[241,0,243,0],[241,1,243,1],[244,0,245,0],[244,1,245,1],[246,0,247,0],[246,1,247,1],[248,0,251,0],[248,1,251,1],[252,0,253,0],[252,1,253,1],[254,0,256,0],[254,1,256,1],[257,0,262,0],[257,1,262,1],[263,0,270,0],[263,1,270,1],[271,0,273,0],[271,1,273,1],[274,0,275,0],[274,1,275,1],[276,0,281,0],[276,1,281,1],[282,0,285,0],[282,1,285,1],[286,0,290,0],[286,1,290,1],[291,0,293,0],[291,1,293,1],[295,0,298,0],[295,1,298,1],[299,0,301,0],[299,1,301,1],[302,0,303,0],[302,1,303,1],[304,0,311,0],[304,1,311,1],[312,0,313,0],[312,1,313,1],[315,0,317,0],[315,1,317,1],[318,0,324,0],[318,1,324,1],[325,0,333,0],[325,1,333,1],[335,0,340,0],[335,1,340,1],[341,0,346,0],[341,1,346,1],[347,0,352,0],[347,1,352,1],[353,0,357,0],[353,1,357,1],[359,0,364,0],[359,1,364,1],[365,0,366,0],[365,1,366,1],[368,0,370,0],[368,1,370,1],[372,0,376,0],[372,1,376,1],[377,0,378,0],[377,1,378,1],[379,0,380,0],[379,1,380,1],[382,0,397,0],[382,1,397,1],[398,0,400,0],[398,1,400,1],[401,0,407,0],[401,1,407,1],[408,0,409,0],[408,1,409,1],[410,0,411,0],[410,1,411,1],[412,0,416,0],[412,1,416,1],[417,0,422,0],[417,1,422,1],[423,0,424,0],[423,1,424,1],[425,0,427,0],[425,1,427,1],[428,0,433,0],[428,1,433,1],[434,0,436,0],[434,1,436,1],[438,0,447,0],[438,1,447,1],[448,0,457,0],[448,1,457,1],[458,0,459,0],[458,1,459,1],[461,0,462,0],[461,1,462,1],[463,0,466,0],[463,1,466,1],[467,0,475,0],[467,1,475,1]]}
["序号","企业名称","招聘职位","人数","专业要求","工资"]
[1,"柳州市鑫正商务信息有限公司","财税顾问",10,"不限专业","3001-4000"]
[null,null,"会计助理",3,"会计学","1501-2000"]
[2,"香港阿波罗(江门)雪糕有限公司","生产技工",10,"食品、机电",4500]
[null,null,"平面/包装设计",2,"设计类专业",4500]
[null,null,"现场QC",5,"食品、机电",4500]
[null,null,"销售培训生",10,"营销类专业",4500]
[null,null,"储备干部",5,"食品、机电或管理专业",4500]
[3,"桂林力源集团柳州市柳新饲料有限责任公司","储备生产骨干",10,"机械类"]
[null,null,"采购物流骨干",5,"不限专业，物流财务类优先"]
[null,null,"储备财务骨干",5,"财务类"]
[null,null,"储备质量骨干",5,"检验检测类"]
[4,"柳州市乐哈哈食品科技有限公司","人力专员",2,"人力资源管理","3001-4000"]
[null,null,"行政专员",2,"不限专业","3001-4000"]
[null,null,"仓管员",1,"物流管理","3001-4000"]
[null,null,"储备干部",20,"不限专业","5001-6000"]
[null,null,"电子商务主管",1,"不限专业","4001-5000"]
[5,"柳州市君麟电子科技有限公司","人事专员",2,"工商管理类","2001-3000"]
[null,null,"销售代表",20,"市场营销","3001-4000"]
[null,null,"前台",1,"公共管理类","2001-3000"]
[6,"柳州长久物流有限公司","现场管理员",2,"物流管理","2001-3000"]
[null,null,"仓储管理",2,"物流管理","2001-3000"]
[7,"广州从化精密钣金制造有限公司","仓储物流员",3,"物流管理","4001-5000"]
[null,null,"数控技术员",10,"机电一体化","4001-5000"]
[null,null,"生产储备干部",10,"机械类","4001-5000"]
[8,"广州壹购房网络科技有限公司","财务助理",3,"会计与审计","4001-5000"]
[null,null,"策划助理",5,"艺术类","4001-5000"]
[9,"辽宁联合物流有限公司柳州分公司","实习生",20,"物流管理","2001-3000"]
[10,"广西保利物业服务有限公司柳州分公司","客户助理（小区）",5,"不限专业","3001-4000"]
[null,null,"工程文员",1,"不限专业","3001-4000"]
[null,null,"暖通技术员",2,"不限专业","3001-4000"]
[null,null,"弱电技术员",2,"不限专业","3001-4000"]
[null,null,"客服助理",1,"不限专业","5001-6000"]
[null,null,"品质专员",1,"物业管理","3001-4000"]
[null,null,"会计",1,"会计学","4001-5000"]
[null,null,"出纳",3,"财务管理","4001-5000"]
[null,null,"行政人事专员",1,"不限专业","4001-5000"]
[11,"广西江山房地产代理有限公司柳州第一分公司","储备干部",20,"市场营销","2001-3000"]
[null,null,"行政秘书",2,"商务管理","3001-4000"]
[null,null,"置业助理",20,"不限专业","3001-4000"]
[null,null,"会计助理",3,"不限专业","2001-3000"]
[12,"柳州天曲生物科技有限公司","营销实习生",10,"区域经济学","3001-4000"]
[null,null,"人事专员",1,"工商管理类","2001-3000"]
[null,null,"主持人",1,"行政管理","3001-4000"]
[null,null,"业务员",8,"市场营销","3001-4000"]
[null,null,"销售代表",8,"市场营销","4001-5000"]
[null,null,"店长助理",3,"不限专业","3001-4000"]
[null,null,"仓库管理文员",1,"不限专业","2001-3000"]
[13,"广西柳州南庭艺筑装饰工程设计有限公司","行政前台",2,"不限专业","2001-3000"]
[null,null,"室内设计师",10,"不限专业","8001-10000"]
[null,null,"销售顾问",10,"不限专业","8001-10000"]
[null,null,"网络营销员",10,"不限专业","8001-10000"]
[null,null,"项目经理(工长）",20,"不限专业","5001-6000"]
[null,null,"会计",2,"不限专业","2001-3000"]
[null,null,"设计师助理",20,"不限专业","2001-3000"]
[null,null,"客户专员",2,"不限专业","6001-8000"]
[null,null,"客服",1,"不限专业","2001-3000"]
[14,"广西同福生物科技有限公司","储备干部",5,"经济学类","3001-4000"]
[null,null,"店长助理",3,"经济学类","4001-5000"]
[null,null,"财务",1,"不限专业","3001-4000"]
[15,"广西心赢销服装有限公司","零售管培生",10,"不限专业","3001-4000"]
[null,null,"会计",1,"财务管理","3001-4000"]
[null,null,"工程监理",1,"土建类","4001-5000"]
[null,null,"物流仓储专员",2,"不限专业","2001-3000"]
[16,"广西中选优粮商贸有限公司","团购主管",10,"不限专业","5001-6000"]
[null,null,"储备干部",8,"不限专业","4001-5000"]
[null,null,"客服专员",2,"不限专业","2001-3000"]
[null,null,"行政前台",2,"不限专业","2001-3000"]
[null,null,"应届毕业生实习岗",10,"不限专业","4001-5000"]
[null,null,"团购专员",10,"不限专业","3001-4000"]
[null,null,"会计",2,"财务会计教育","2001-3000"]
[null,null,"活动主持人",1,"不限专业","3001-4000"]
[18,"广东金众科技有限公司","银行风控专员",50,"工商管理类","5001-6000"]
[null,null,"消费金融机构客服专员",50,"工商管理类","5001-6000"]
[19,"广东百年乾合健康产业投资股份有限公司","毕业实习生",10,"不限专业","3001-4000"]
[null,null,"储备干部",5,"不限专业","3001-4000"]
[null,null,"经理助理",5,"不限专业","4001-5000"]
[null,null,"人事部助理",2,"人力资源管理","3001-4000"]
[20,"广东碧桂园物业服务股份有限公司柳州分公司","综合职能岗（2019届毕业生）",5,"工商管理","3001-4000"]
[null,null,"综合职能岗（2019届毕业生）",5,"工商管理","3001-4000"]
[null,null,"人力资源助理（2019届毕业实习生）",2,"人力资源管理","2001-3000"]
[null,null,"技术管理岗（工程/环境）2019届毕业生",20,"不限专业","3001-4000"]
[21,"广东德律信用管理股份有限公司柳州分公司","银行风控专员",10,"不限专业","4001-5000"]
[null,null,"银行客户关系维护员",10,"不限专业","4001-5000"]
[null,null,"人事专员",2,"不限专业","3001-4000"]
[null,null,"财务助理",2,"不限专业","565-1000"]
[22,"广西宝骏汽车销售有限公司","销售顾问",8,"工商管理","6001-8000"]
[null,null,"市场专员",2,"市场营销","2001-3000"]
[null,null,"客服专员",3,"不限专业","2001-3000"]
[null,null,"电销专员",6,"经济学类","2001-3000"]
[null,null,"行政专员",2,"经济学类","2001-3000"]
[null,null,"销售顾问助理",2,"经济学类","4001-5000"]
[23,"南宁冠泽同康科技有限公司","健康顾问",3,"不限专业","3001-4000"]
[null,null,"客服专员",2,"不限专业","3001-4000"]
[null,null,"财务专员",2,"不限专业","3001-4000"]
[null,null,"连锁店店长",5,"连锁经营管理","4001-5000"]
[null,null,"讲师助理",8,"不限专业","565-1000"]
[null,null,"人事专员",2,"不限专业","3001-4000"]
[null,null,"店长助理",10,"工商管理类","3001-4000"]
[null,null,"储备干部",8,"不限专业","3001-4000"]
[24,"柳州国美电器有限公司","中央空调业务主管",3,"不限专业","4001-5000"]
[null,null,"对公业务主管/经理",2,"不限专业","8001-10000"]
[null,null,"家装业务部主管",2,"不限专业","4001-5000"]
[null,null,"储备店长",10,"不限专业","6001-8000"]
[null,null,"门店销售主管/主任",10,"不限专业","4001-5000"]
[null,null,"会计（来宾）",1,"财务管理","1501-2000"]
[null,null,"业务主管",2,"不限专业","4001-5000"]
[null,null,"储备副店长（融安）",2,"不限专业","4001-5000"]
[null,null,"防损主管兼司机",1,"不限专业","3001-4000"]
[null,null,"门店销售主管（柳城）",1,"不限专业","3001-4000"]
[null,null,"储备副店长",5,"不限专业","4001-5000"]
[null,null,"门店会计/收银员",3,"不限专业","2001-3000"]
[null,null,"人事行政专员(工作地：来宾）",1,"不限专业","2001-3000"]
[null,null,"空调安装师傅",2,"不限专业","3001-4000"]
[null,null,"人事专员（2019届毕业生）",10,"不限专业","2001-3000"]
[null,null,"综合岗（客服兼收银）",2,"不限专业","2001-3000"]
[null,null,"门店促销员/营业员",20,"不限专业","4001-5000"]
[null,null,"业务（2019届毕业生）",3,"不限专业","3001-4000"]
[null,null,"销售主管助理（2019届毕业生）",5,"不限专业","3001-4000"]
[null,null,"储备店长（武宣）",2,"不限专业","5001-6000"]
[null,null,"人事招聘专员",1,"人力资源管理","3001-4000"]
[25,"柳州慧算账会计服务有限公司","销售经理",1,"不限专业","6001-8000"]
[null,null,"电话销售（无责底薪+高提成）",10,"不限专业","3001-4000"]
[null,null,"销售主管",2,"不限专业","5001-6000"]
[null,null,"全账会计",2,"不限专业","2001-3000"]
[null,null,"电话销售（无责底薪+高提成）",10,"不限专业","3001-4000"]
[null,null,"电话销售（无责底薪+高提成）",10,"不限专业","3001-4000"]
[null,null,"毕业生优先考虑",10,"不限专业","3001-4000"]
[26,"柳州金盾机械股份有限公司","统计员、仓管",1,"不限专业","3001-4000"]
[null,null,"质量检验员",1,"机械类其他专业","3001-4000"]
[null,null,"技术员",3,"机械类","4001-5000"]
[null,null,"生产部长",1,"机械类","4001-5000"]
[null,null,"金相分析员",1,"材料类","4001-5000"]
[null,null,"车间主任",2,"机械类","5001-6000"]
[null,null,"外贸业务员",1,"工商管理类","4001-5000"]
[null,null,"高新技术开发员",3,"机械类","5001-6000"]
[null,null,"金属材料类技术员",2,"机械类","4001-5000"]
[null,null,"出纳",1,"会计与统计","3001-4000"]
[null,null,"技术部主管",1,"机械类","6001-8000"]
[27,"柳州品匠家居装饰工程有限公司","美工",3,"不限专业","5001-6000"]
[null,null,"仓管",4,"不限专业","2001-3000"]
[null,null,"网站UI设计师（偏美工方向）",2,"艺术设计","5001-6000"]
[null,null,"室内设计师",3,"艺术类","10001-15000"]
[null,null,"行政前台经理",1,"行政管理","5001-6000"]
[null,null,"客服",3,"不限专业","2001-3000"]
[null,null,"外派会计",1,"不限专业","2001-3000"]
[null,null,"网络销售员",5,"不限专业","8001-10000"]
[28,"柳州星力量汽车配件有限公司","财务实习生",1,"会计学","1501-2000"]
[29,"广西联华超市股份有限公司","人事专员",3,"人力资源管理","2001-3000"]
[null,null,"储备人员",15,"不限专业","2001-3000"]
[null,null,"电脑员",5,"财务管理","2001-3000"]
[null,null,"收银员/防损员/营业员",100,"不限专业","1501-2000"]
[30,"深圳市览众房地产经纪有限公司","出纳助理",2,"会计与审计","3001-4000"]
[null,null,"会计助理",1,"工商管理类","3001-4000"]
[null,null,"营销储备干部",3,"不限专业","5001-6000"]
[31,"柳州市美极名豪家具有限公司","副总助理",2,"工商管理类","4001-5000"]
[null,null,"网络美工",3,"不限专业","3001-4000"]
[null,null,"定制家具设计师",5,"不限专业","5001-6000"]
[null,null,"家具导购",5,"不限专业","3001-4000"]
[null,null,"前台接待",2,"不限专业","3001-4000"]
[null,null,"家装设计师",8,"室内设计","6001-8000"]
[null,null,"家居设计师助理",8,"室内设计","3001-4000"]
[null,null,"客服经理",3,"不限专业","4001-5000"]
[null,null,"家装市场部专员",8,"不限专业","4001-5000"]
[null,null,"销售主管",2,"不限专业","4001-5000"]
[null,null,"人事主管",2,"工商管理类","3001-4000"]
[null,null,"文员",2,"不限专业","2001-3000"]
[32,"深圳市航盛电子股份有限公司","储备干部",40,"不限专业","4001-5000"]
[null,null,"物料员",3,"不限专业","4001-5000"]
[null,null,"仓库管理",2,"不限专业","4001-5000"]
[null,null,"精密测试员",8,"不限专业","4001-5000"]
[null,null,"文员",4,"不限专业","565-1000"]
[null,null,"质量管理员",8,"不限专业","4001-5000"]
[33,"柳州市万福投资有限公司","理财销售",10,"经济学类","3001-4000"]
[34,"迪卡侬（东莞）仓储有限公司","物流全渠道运动负责人",30,"不限","3000以上"]
[35,"柳州市友商物资有限责任公司","会计",2,"经济学","2001-3000"]
[null,null,"出纳",1,"财政学","2001-3000"]
[null,null,"开单员",1,"不限专业","3001-4000"]
[null,null,"业务员",1,"不限专业","3001-4000"]
[36,"北京深度空间装饰工程有限公司柳州地王分公司","业务专员",10,"不限专业","5001-6000"]
[null,null,"家具设计师",3,"不限专业","2001-3000"]
[null,null,"前台/客户经理",3,"不限专业","8001-10000"]
[null,null,"预算员",1,"不限专业","2001-3000"]
[null,null,"室内设计师(配助理）",5,"艺术设计","8001-10000"]
[null,null,"家装顾问",10,"不限专业","2001-3000"]
[null,null,"网络营销",5,"不限专业","5001-6000"]
[null,null,"人事专员",1,"不限专业","3001-4000"]
[null,null,"设计师助理",5,"装潢艺术设计","1001-1500"]
[null,null,"财务会计",1,"会计学","2001-3000"]
[37,"顺丰速运（东莞）有限公司","现场QC",5,"食品、机电",4500]
[null,null,"销售培训生",10,"营销类专业",4500]
[null,null,"储备干部",5,"食品、机电或管理专业",4500]
[38,"山东航铁集团有限公司南宁分公司","会计",2,"经济学","2001-3000"]
[null,null,"人力资源人事干事、储备干部、学校辅导员",6,"行政管理","2001-3000"]
[39,"上海仙茶美文化咨询有限公司","储备干部包吃住",5,"不限专业","2001-3000"]
[null,null,"培训讲师方向包吃住",2,"不限专业","2001-3000"]
[null,null,"茶品营销方向包吃住",5,"不限专业","2001-3000"]
[null,null,"茶艺师",20,"不限专业","3001-4000"]
[null,null,"储备干部",5,"不限专业","4001-5000"]
[null,null,"茶品营销",5,"不限专业","4001-5000"]
{"$rows_left_out":277}
{"sheet":"Sheet1","index":1,"n_rows":106,"n_cols":4,"rows_kept":106}
["序号","企业名称"]
[1,"柳州市鑫正商务信息有限公司",{"$f":"VLOOKUP(B2,[1]Sheet1!$B:$C,2,0)","v":1},{"$f":"A2-C2","v":0}]
[2,"香港阿波罗(江门)雪糕有限公司",{"$f":"VLOOKUP(B3,[1]Sheet1!$B:$C,2,0)","v":2},{"$f":"A3-C3","v":0}]
[3,"桂林力源集团柳州市柳新饲料有限责任公司",{"$f":"VLOOKUP(B4,[1]Sheet1!$B:$C,2,0)","v":3},0]
[4,"柳州市乐哈哈食品科技有限公司",{"$f":"VLOOKUP(B5,[1]Sheet1!$B:$C,2,0)","v":4},0]
[5,"柳州市君麟电子科技有限公司",{"$f":"VLOOKUP(B6,[1]Sheet1!$B:$C,2,0)","v":5},0]
[6,"柳州长久物流有限公司",{"$f":"VLOOKUP(B7,[1]Sheet1!$B:$C,2,0)","v":6},0]
[7,"广州从化精密钣金制造有限公司",{"$f":"VLOOKUP(B8,[1]Sheet1!$B:$C,2,0)","v":7},0]
[8,"广州壹购房网络科技有限公司",{"$f":"VLOOKUP(B9,[1]Sheet1!$B:$C,2,0)","v":8},0]
[9,"辽宁联合物流有限公司柳州分公司",{"$f":"VLOOKUP(B10,[1]Sheet1!$B:$C,2,0)","v":9},0]
[10,"广西保利物业服务有限公司柳州分公司",{"$f":"VLOOKUP(B11,[1]Sheet1!$B:$C,2,0)","v":10},0]
[11,"广西江山房地产代理有限公司柳州第一分公司",{"$f":"VLOOKUP(B12,[1]Sheet1!$B:$C,2,0)","v":11},0]
[12,"柳州天曲生物科技有限公司",{"$f":"VLOOKUP(B13,[1]Sheet1!$B:$C,2,0)","v":12},0]
[13,"广西柳州南庭艺筑装饰工程设计有限公司",{"$f":"VLOOKUP(B14,[1]Sheet1!$B:$C,2,0)","v":13},0]
[14,"广西同福生物科技有限公司",{"$f":"VLOOKUP(B15,[1]Sheet1!$B:$C,2,0)","v":14},0]
[15,"广西心赢销服装有限公司",{"$f":"VLOOKUP(B16,[1]Sheet1!$B:$C,2,0)","v":15},0]
[16,"广西中选优粮商贸有限公司",{"$f":"VLOOKUP(B17,[1]Sheet1!$B:$C,2,0)","v":16},0]
[18,"广东金众科技有限公司",{"$f":"VLOOKUP(B18,[1]Sheet1!$B:$C,2,0)","v":18},0]
[19,"广东百年乾合健康产业投资股份有限公司",{"$f":"VLOOKUP(B19,[1]Sheet1!$B:$C,2,0)","v":19},0]
[20,"广东碧桂园物业服务股份有限公司柳州分公司",{"$f":"VLOOKUP(B20,[1]Sheet1!$B:$C,2,0)","v":20},0]
[21,"广东德律信用管理股份有限公司柳州分公司",{"$f":"VLOOKUP(B21,[1]Sheet1!$B:$C,2,0)","v":21},0]
[22,"广西宝骏汽车销售有限公司",{"$f":"VLOOKUP(B22,[1]Sheet1!$B:$C,2,0)","v":22},0]
[23,"南宁冠泽同康科技有限公司",{"$f":"VLOOKUP(B23,[1]Sheet1!$B:$C,2,0)","v":23},0]
[24,"柳州国美电器有限公司",{"$f":"VLOOKUP(B24,[1]Sheet1!$B:$C,2,0)","v":24},0]
[25,"柳州慧算账会计服务有限公司",{"$f":"VLOOKUP(B25,[1]Sheet1!$B:$C,2,0)","v":25},0]
[26,"柳州金盾机械股份有限公司",{"$f":"VLOOKUP(B26,[1]Sheet1!$B:$C,2,0)","v":26},0]
[27,"柳州品匠家居装饰工程有限公司",{"$f":"VLOOKUP(B27,[1]Sheet1!$B:$C,2,0)","v":27},0]
[28,"柳州星力量汽车配件有限公司",{"$f":"VLOOKUP(B28,[1]Sheet1!$B:$C,2,0)","v":28},0]
[29,"广西联华超市股份有限公司",{"$f":"VLOOKUP(B29,[1]Sheet1!$B:$C,2,0)","v":29},0]
[30,"深圳市览众房地产经纪有限公司",{"$f":"VLOOKUP(B30,[1]Sheet1!$B:$C,2,0)","v":30},0]
[31,"柳州市美极名豪家具有限公司",{"$f":"VLOOKUP(B31,[1]Sheet1!$B:$C,2,0)","v":31},0]
[32,"深圳市航盛电子股份有限公司",{"$f":"VLOOKUP(B32,[1]Sheet1!$B:$C,2,0)","v":32},0]
[33,"柳州市万福投资有限公司",{"$f":"VLOOKUP(B33,[1]Sheet1!$B:$C,2,0)","v":33},0]
[34,"迪卡侬（东莞）仓储有限公司",{"$f":"VLOOKUP(B34,[1]Sheet1!$B:$C,2,0)","v":34},0]
[35,"柳州市友商物资有限责任公司",{"$f":"VLOOKUP(B35,[1]Sheet1!$B:$C,2,0)","v":35},{"$f":"A35-C35","v":0}]
[36,"北京深度空间装饰工程有限公司柳州地王分公司",{"$f":"VLOOKUP(B36,[1]Sheet1!$B:$C,2,0)","v":36},0]
[37,"顺丰速运（东莞）有限公司",{"$f":"VLOOKUP(B37,[1]Sheet1!$B:$C,2,0)","v":37},0]
[38,"山东航铁集团有限公司南宁分公司",{"$f":"VLOOKUP(B38,[1]Sheet1!$B:$C,2,0)","v":38},0]
[39,"上海仙茶美文化咨询有限公司",{"$f":"VLOOKUP(B39,[1]Sheet1!$B:$C,2,0)","v":39},0]
[40,"深圳市大广发物流有限公司",{"$f":"VLOOKUP(B40,[1]Sheet1!$B:$C,2,0)","v":40},0]
[41,"柳州延龙汽车有限公司",{"$f":"VLOOKUP(B41,[1]Sheet1!$B:$C,2,0)","v":41},0]
[42,"柳州尚龙电器有限公司",{"$f":"VLOOKUP(B42,[1]Sheet1!$B:$C,2,0)","v":42},0]
[43,"比亚迪股份有限公司",{"$f":"VLOOKUP(B43,[1]Sheet1!$B:$C,2,0)","v":43},0]
[44,"柳州长虹航天技术有限公司",{"$f":"VLOOKUP(B44,[1]Sheet1!$B:$C,2,0)","v":44},0]
[45,"柳州上汽汽车变速器有限公司柳东分公司",{"$f":"VLOOKUP(B45,[1]Sheet1!$B:$C,2,0)","v":45},0]
[46,"柳州一阳科技有限公司",{"$f":"VLOOKUP(B46,[1]Sheet1!$B:$C,2,0)","v":46},0]
[47,"广西柳州特种变压器有限责任公司",{"$f":"VLOOKUP(B47,[1]Sheet1!$B:$C,2,0)","v":47},0]
[48,"广西明泉自动化设备有限公司",{"$f":"VLOOKUP(B48,[1]Sheet1!$B:$C,2,0)","v":48},0]
[49,"广西强冠建设工程有限公司",{"$f":"VLOOKUP(B49,[1]Sheet1!$B:$C,2,0)","v":49},0]
[50,"日特固（广州）防音配件有限公司",{"$f":"VLOOKUP(B50,[1]Sheet1!$B:$C,2,0)","v":50},0]
[51,"上汽通用五菱汽车股份有限公司",{"$f":"VLOOKUP(B51,[1]Sheet1!$B:$C,2,0)","v":51},0]
[52,"柳州正远机电有限公司",{"$f":"VLOOKUP(B52,[1]Sheet1!$B:$C,2,0)","v":52},0]
[53,"光宝集团-光宝电子（广州）有限公司",{"$f":"VLOOKUP(B53,[1]Sheet1!$B:$C,2,0)","v":53},0]
[54,"桂林福达股份有限公司",{"$f":"VLOOKUP(B54,[1]Sheet1!$B:$C,2,0)","v":54},0]
[55,"广西高峰桂山人造板有限公司",{"$f":"VLOOKUP(B55,[1]Sheet1!$B:$C,2,0)","v":55},0]
[56,"东莞市达瑞电子股份有限公司",{"$f":"VLOOKUP(B56,[1]Sheet1!$B:$C,2,0)","v":56},0]
[57,"广西合元汽车投资有限公司",{"$f":"VLOOKUP(B57,[1]Sheet1!$B:$C,2,0)","v":57},0]
[58,"广西建工轨道装配预制混凝土有限公司",{"$f":"VLOOKUP(B58,[1]Sheet1!$B:$C,2,0)","v":58},0]
[59,"中粮油脂（钦州）有限公司",{"$f":"VLOOKUP(B59,[1]Sheet1!$B:$C,2,0)","v":59},0]
[60,"深圳汉弘数码印刷集团",{"$f":"VLOOKUP(B60,[1]Sheet1!$B:$C,2,0)","v":60},0]
[61,"深圳市创荣发电子有限公司",{"$f":"VLOOKUP(B61,[1]Sheet1!$B:$C,2,0)","v":61},0]
[62,"深圳市龙城机电安装工程有限公司",{"$f":"VLOOKUP(B62,[1]Sheet1!$B:$C,2,0)","v":62},0]
[63,"深圳市欣佰德精密模具有限公司",{"$f":"VLOOKUP(B63,[1]Sheet1!$B:$C,2,0)","v":63},0]
[64,"中星中大印刷（深圳）有限公司",{"$f":"VLOOKUP(B64,[1]Sheet1!$B:$C,2,0)","v":64},0]
[66,"广西千里马临工机械有限公司",{"$f":"VLOOKUP(B65,[1]Sheet1!$B:$C,2,0)","v":66},0]
[67,"广西五象塑业发展有限公司",{"$f":"VLOOKUP(B66,[1]Sheet1!$B:$C,2,0)","v":67},0]
[68,"广西云高智能停车设备有限公司",{"$f":"VLOOKUP(B67,[1]Sheet1!$B:$C,2,0)","v":68},{"$f":"A67-C67","v":0}]
[69,"广西奥特帕斯机械有限公司",{"$f":"VLOOKUP(B68,[1]Sheet1!$B:$C,2,0)","v":69},0]
[70,"广西东沐科技有限公司",{"$f":"VLOOKUP(B69,[1]Sheet1!$B:$C,2,0)","v":70},0]
[72,"南丹县南方有色金属有限责任公司",{"$f":"VLOOKUP(B70,[1]Sheet1!$B:$C,2,0)","v":72},0]
[73,"柳州柳工人力资源服务公司",{"$f":"VLOOKUP(B71,[1]Sheet1!$B:$C,2,0)","v":73},0]
[74,"柳州柳工挖掘机有限公司",{"$f":"VLOOKUP(B72,[1]Sheet1!$B:$C,2,0)","v":74},0]
[75,"广西柳工机械股份有限公司",{"$f":"VLOOKUP(B73,[1]Sheet1!$B:$C,2,0)","v":75},0]
[76,"广东中德电缆有限公司",{"$f":"VLOOKUP(B74,[1]Sheet1!$B:$C,2,0)","v":76},0]
[77,"鸿利智汇集团股份有限公司",{"$f":"VLOOKUP(B75,[1]Sheet1!$B:$C,2,0)","v":77},0]
[78,"东莞智富五金制品有限公司",{"$f":"VLOOKUP(B76,[1]Sheet1!$B:$C,2,0)","v":78},0]
[79,"东莞市爱康电子科技有限公司",{"$f":"VLOOKUP(B77,[1]Sheet1!$B:$C,2,0)","v":79},0]
[80,"东莞市发斯特精密五金有限公司",{"$f":"VLOOKUP(B78,[1]Sheet1!$B:$C,2,0)","v":80},0]
[81,"东莞市维峰五金电子有限公司",{"$f":"VLOOKUP(B79,[1]Sheet1!$B:$C,2,0)","v":81},0]
[82,"东莞市众兴模具有限公司",{"$f":"VLOOKUP(B80,[1]Sheet1!$B:$C,2,0)","v":82},0]
[83,"柳州五菱柳机动力有限公司",{"$f":"VLOOKUP(B81,[1]Sheet1!$B:$C,2,0)","v":83},0]
[84,"广东美芝制冷设备有限公司",{"$f":"VLOOKUP(B82,[1]Sheet1!$B:$C,2,0)","v":84},0]
[85,"广东文灿压铸股份有限公司",{"$f":"VLOOKUP(B83,[1]Sheet1!$B:$C,2,0)","v":85},0]
[86,"广东长虹电子有限公司",{"$f":"VLOOKUP(B84,[1]Sheet1!$B:$C,2,0)","v":86},0]
[87,"十一冶建设集团有限责任公司第五建筑安装工程分公司",{"$f":"VLOOKUP(B85,[1]Sheet1!$B:$C,2,0)","v":87},0]
[88,"特大纺织制品（深圳）有限公司",{"$f":"VLOOKUP(B86,[1]Sheet1!$B:$C,2,0)","v":88},0]
[89,"西藏朗明机电技术股份有限公司",{"$f":"VLOOKUP(B87,[1]Sheet1!$B:$C,2,0)","v":89},0]
[90,"柳州市久日工程机械有限公司",{"$f":"VLOOKUP(B88,[1]Sheet1!$B:$C,2,0)","v":90},0]
[91,"华润混凝土（柳州）有限公司",{"$f":"VLOOKUP(B89,[1]Sheet1!$B:$C,2,0)","v":91},0]
[92,"惠州市华阳精机有限公司",{"$f":"VLOOKUP(B90,[1]Sheet1!$B:$C,2,0)","v":92},0]
[93,"柳州东城酒店投资管理有限公司（柳州东城华美达广场酒店）",{"$f":"VLOOKUP(B91,[1]Sheet1!$B:$C,2,0)","v":93},0]
[94,"柳州东风李尔方盛汽车座椅有限公司",{"$f":"VLOOKUP(B92,[1]Sheet1!$B:$C,2,0)","v":94},0]
[95,"柳州佳力电机股份有限公司",{"$f":"VLOOKUP(B93,[1]Sheet1!$B:$C,2,0)","v":95},0]
[96,"柳州立和机械有限公司",{"$f":"VLOOKUP(B94,[1]Sheet1!$B:$C,2,0)","v":96},0]
[97,"柳州汽车检测有限公司",{"$f":"VLOOKUP(B95,[1]Sheet1!$B:$C,2,0)","v":97},0]
[98,"柳州瑞明汽车部件制造有限公司",{"$f":"VLOOKUP(B96,[1]Sheet1!$B:$C,2,0)","v":98},0]
[99,"柳州市华侨紧固件厂",{"$f":"VLOOKUP(B97,[1]Sheet1!$B:$C,2,0)","v":99},0]
[100,"柳州市荆大汽车制动管制造有限公司",{"$f":"VLOOKUP(B98,[1]Sheet1!$B:$C,2,0)","v":100},0]
[101,"柳州市源通精密机械制造有限公司",{"$f":"VLOOKUP(B99,[1]Sheet1!$B:$C,2,0)","v":101},{"$f":"A99-C99","v":0}]
[102,"柳州万超汽车天窗有限公司",{"$f":"VLOOKUP(B100,[1]Sheet1!$B:$C,2,0)","v":102},{"$f":"A100-C100","v":0}]
[103,"柳州市顺菱汽车配件有限责任公司",{"$f":"VLOOKUP(B101,[1]Sheet1!$B:$C,2,0)","v":103},{"$f":"A101-C101","v":0}]
[104,"瑞立集团瑞安汽车零部件有限公司",{"$f":"VLOOKUP(B102,[1]Sheet1!$B:$C,2,0)","v":104},{"$f":"A102-C102","v":0}]
[105,"上海邯新自动化设备技术有限公司",{"$f":"VLOOKUP(B103,[1]Sheet1!$B:$C,2,0)","v":105},{"$f":"A103-C103","v":0}]
[106,"佛山宝润金属制品有限公司",{"$f":"VLOOKUP(B104,[1]Sheet1!$B:$C,2,0)","v":106},{"$f":"A104-C104","v":0}]
[107,"佛山市顺德海尔电器有限公司",{"$f":"VLOOKUP(B105,[1]Sheet1!$B:$C,2,0)","v":107},{"$f":"A105-C105","v":0}]
[108,"广西津鸿投资管理有限公司",{"$f":"VLOOKUP(B106,[1]Sheet1!$B:$C,2,0)","v":108},{"$f":"A106-C106","v":0}]